Reaction Details
TargetAlpha-2B adrenergic receptor
LigandBDBM50408236
Substrate/Competitorn/a
Meas. Tech.ChEMBL_33508 (CHEMBL647005)
Ki 6500±n/a nM
Citation Elworthy, TRFord, APBantle, GWMorgans, DJOzer, RSPalmer, WSRepke, DBRomero, MSandoval, LSjogren, EBTalamás, FXVazquez, AWu, HArredondo, NFBlue, DRDeSousa, AGross, LMKava, MSLesnick, JDVimont, RLWilliams, TJZhu, QMPfister, JRClarke, DE N-arylpiperazinyl-N'-propylamino derivatives of heteroaryl amides as functional uroselective alpha 1-adrenoceptor antagonists. J Med Chem40:2674-87 (1997) 
 
Alpha-2B adrenergic receptor
Name:Alpha-2B adrenergic receptor
Type:Enzyme Catalytic Domain
Mol. Mass.:50379.83
Organism:NEONATAL RAT
Description:adrenergic Alpha2B ADRA2B NEONATAL RAT::P19328
Residue:453
BDBM50408236
NameBDBM50408236
Synonyms:CHEMBL420620
TypeSmall organic molecule
Emp. Form.C22H30FN5O2
Mol. Mass.415.5043
SMILESCOc1cc(F)ccc1N1CCN(CCCNc2ncccc2C(=O)N(C)C)CC1