Reaction Details
Target5-hydroxytryptamine receptor 1B
LigandBDBM79215
Substrate/Competitorn/a
Meas. Tech.ChEMBL_1383 (CHEMBL616455)
Ki 1±n/a nM
Citation Gaster, LMBlaney, FEDavies, SDuckworth, DMHam, PJenkins, SJennings, AJJoiner, GFKing, FDMulholland, KRWyman, PAHagan, JJHatcher, JJones, BJMiddlemiss, DNPrice, GWRiley, GRoberts, CRoutledge, CSelkirk, JSlade, PD The selective 5-HT1B receptor inverse agonist 1'-methyl-5-[[2'-methyl-4'-(5-methyl-1,2, 4-oxadiazol-3-yl)biphenyl-4-yl]carbonyl]-2,3,6,7-tetrahydro- spiro[furo[2,3-f]indole-3,4'-piperidine] (SB-224289) potently blocks terminal 5-HT autoreceptor function both in vitro and in vivo. J Med Chem41:1218-35 (1998) 
 
5-hydroxytryptamine receptor 1B
Name:5-hydroxytryptamine receptor 1B
Type:G Protein-Coupled Receptor (GPCR)
Mol. Mass.:43579.17
Organism:Homo sapiens (Human)
Description:Receptor binding assays were performed using human clone stably expressed in CHO cells
Residue:390
BDBM79215
NameBDBM79215
Synonyms:CHEMBL15928 GR 127935 hydrochloride hydrate N-[4-methoxy-3-(4-methyl-1-piperazinyl)phenyl]-4-[2-methyl-4-(5-methyl-1,2,4-oxadiazol-3-yl)phenyl]benzamide;hydrochloride N-[4-methoxy-3-(4-methylpiperazino)phenyl]-4-[2-methyl-4-(5-methyl-1,2,4-oxadiazol-3-yl)phenyl]benzamide;hydrochloride cid_11497466
TypeSmall organic molecule
Emp. Form.C29H31N5O3
Mol. Mass.497.5881
SMILESCOc1ccc(NC(=O)c2ccc(cc2)-c2ccc(cc2C)-c2noc(C)n2)cc1N1CCN(C)CC1