Reaction Details
TargetReverse transcriptase/RNaseH
LigandBDBM50408882
Substrate/Competitorn/a
Meas. Tech.ChEMBL_42166 (CHEMBL655350)
EC50>10000±n/a nM
Citation Pontikis, RDollé, VGuillaumel, JDechaux, ENote, RNguyen, CHLegraverend, MBisagni, EAubertin, AMGrierson, DSMonneret, C Synthesis and evaluation of"AZT-HEPT","AZT-pyridinone", and"ddC-HEPT" conjugates as inhibitors of HIV reverse transcriptase. J Med Chem43:1927-39 (2000) Reverse transcriptase/RNaseH
Name:Reverse transcriptase/RNaseH
Type:PROTEIN
Mol. Mass.:65229.15
Organism:Human immunodeficiency virus 1
Description:ChEMBL_1473730
Residue:566
BDBM50408882
NameBDBM50408882
Synonyms:CHEMBL59514
TypeSmall organic molecule
Emp. Form.C40H56N8O7
Mol. Mass.760.922
SMILESCCc1c(C)[nH]c(=O)c(NC(=O)CCCCCCCCCNC(=O)CCOCC2OC(CC2N=[N+]=[N-])n2cc(C)c(=O)[nH]c2=O)c1Cc1cc(C)cc(C)c1