Reaction Details
TargetReverse transcriptase/RNaseH
LigandBDBM50408886
Substrate/Competitorn/a
Meas. Tech.ChEMBL_42166 (CHEMBL655350)
EC50 58000±n/a nM
Citation Pontikis, RDollé, VGuillaumel, JDechaux, ENote, RNguyen, CHLegraverend, MBisagni, EAubertin, AMGrierson, DSMonneret, C Synthesis and evaluation of"AZT-HEPT","AZT-pyridinone", and"ddC-HEPT" conjugates as inhibitors of HIV reverse transcriptase. J Med Chem43:1927-39 (2000) Reverse transcriptase/RNaseH
Name:Reverse transcriptase/RNaseH
Type:PROTEIN
Mol. Mass.:65229.15
Organism:Human immunodeficiency virus 1
Description:ChEMBL_1473730
Residue:566
BDBM50408886
NameBDBM50408886
Synonyms:CHEMBL57929
TypeSmall organic molecule
Emp. Form.C27H41N3O2
Mol. Mass.439.6333
SMILESCCc1c(C)[nH]c(=O)c(NC(=O)CCCCCCCCCN)c1Cc1cc(C)cc(C)c1