Reaction Details
TargetHistamine H3 receptor
LigandBDBM50410342
Substrate/Competitorn/a
Meas. Tech.ChEMBL_304030 (CHEMBL840208)
Ki 0.447±n/a nM
Citation Dvorak, CAApodaca, RBarbier, AJBerridge, CWWilson, SJBoggs, JDXiao, WLovenberg, TWCarruthers, NI 4-phenoxypiperidines: potent, conformationally restricted, non-imidazole histamine H3 antagonists. J Med Chem48:2229-38 (2005) 
 
Histamine H3 receptor
Name:Histamine H3 receptor
Type:G Protein-Coupled Receptor (GPCR)
Mol. Mass.:48691.47
Organism:Homo sapiens (Human)
Description:Binding assays were using CHO cells stably expressing hH3R receptors.
Residue:445
BDBM50410342
NameBDBM50410342
Synonyms:CHEMBL195408
TypeSmall organic molecule
Emp. Form.C16H18N2O
Mol. Mass.254.3269
SMILESC[C@@H]1CCCN1CCc1cc2cc(ccc2o1)C#N