Reaction Details
TargetUrotensin-2 receptor
LigandBDBM50002725
Substrate/Competitorn/a
Meas. Tech.ChEMBL_412858 (CHEMBL910631)
Ki 1.6±n/a nM
Citation Chatenet, DDubessy, CBoularan, CScalbert, EPfeiffer, BRenard, PLihrmann, IPacaud, PTonon, MCVaudry, HLeprince, J Structure-activity relationships of a novel series of urotensin II analogues: identification of a urotensin II antagonist. J Med Chem49:7234-8 (2006) 
 
Urotensin-2 receptor
Name:Urotensin-2 receptor
Type:Enzyme Catalytic Domain
Mol. Mass.:42159.71
Organism:Homo sapiens (Human)
Description:Urotensin-II UTS2R HUMAN::Q9UKP6
Residue:389
BDBM50002725
NameBDBM50002725
Synonyms:CHEMBL374468
TypeSmall organic molecule
Emp. Form.C51H66N10O12S2
Mol. Mass.1075.26
SMILESCN[C@@H](CC(O)=O)C(=O)N[C@H]1CSSC[C@H](NC(=O)[C@H](Cc2ccc(O)cc2)NC(=O)[C@H](CCCCN)NC(=O)[C@H](Cc2c[nH]c3ccccc23)NC(=O)[C@H](Cc2ccccc2)NC1=O)C(=O)N[C@@H](C(C)C)C(O)=O