Reaction Details
TargetHistidine-rich protein PFHRP-II
LigandBDBM50041457
Substrate/Competitorn/a
Meas. Tech.ChEMBL_422247 (CHEMBL855965)
IC50 790000000±n/a nM
Citation Gemma, SKukreja, GFattorusso, CPersico, MRomano, MPAltarelli, MSavini, LCampiani, GFattorusso, EBasilico, NTaramelli, DYardley, VButini, S Synthesis of N1-arylidene-N2-quinolyl- and N2-acrydinylhydrazones as potent antimalarial agents active against CQ-resistant P. falciparum strains. Bioorg Med Chem Lett16:5384-8 (2006) 
 
Histidine-rich protein PFHRP-II
Name:Histidine-rich protein PFHRP-II
Type:PROTEIN
Mol. Mass.:35156.49
Organism:Plasmodium falciparum
Description:ChEMBL_500704
Residue:332
BDBM50041457
NameBDBM50041457
Synonyms:4-[(7-chloroquinolin-4-yl)amino]-2-[(diethylamino)methyl]phenol CHEMBL682 | med.21724, Compound 188
TypeSmall organic molecule
Emp. Form.C20H22ClN3O
Mol. Mass.355.861
SMILESCCN(CC)Cc1cc(Nc2ccnc3cc(Cl)ccc23)ccc1O