Reaction Details
TargetHistidine-rich protein PFHRP-II
LigandBDBM50041457
Substrate/Competitorn/a
Meas. Tech.ChEMBL_426926 (CHEMBL909252)
IC50 167000±n/a nM
Citation Huy, NTUyen, DTMaeda, ATrang, DTOida, THarada, SKamei, K Simple colorimetric inhibition assay of heme crystallization for high-throughput screening of antimalarial compounds. Antimicrob Agents Chemother51:350-3 (2006) 
 
Histidine-rich protein PFHRP-II
Name:Histidine-rich protein PFHRP-II
Type:PROTEIN
Mol. Mass.:35156.49
Organism:Plasmodium falciparum
Description:ChEMBL_500704
Residue:332
BDBM50041457
NameBDBM50041457
Synonyms:4-[(7-chloroquinolin-4-yl)amino]-2-[(diethylamino)methyl]phenol CHEMBL682 | med.21724, Compound 188
TypeSmall organic molecule
Emp. Form.C20H22ClN3O
Mol. Mass.355.861
SMILESCCN(CC)Cc1cc(Nc2ccnc3cc(Cl)ccc23)ccc1O