Reaction Details
TargetCholecystokinin receptor type A
LigandBDBM50002878
Substrate/Competitorn/a
Meas. Tech.ChEMBL_439005 (CHEMBL889351)
Ki<10000±n/a nM
Citation McDonald, IMBlack, JWBuck, IMDunstone, DJGriffin, EPHarper, EAHull, RAKalindjian, SBLilley, EJLinney, IDPether, MJRoberts, SPShaxted, MESpencer, JSteel, KISykes, DAWalker, MKWatt, GFWright, LWright, PTXun, W Optimization of 1,3,4-benzotriazepine-based CCK(2) antagonists to obtain potent, orally active inhibitors of gastrin-mediated gastric acid secretion. J Med Chem50:3101-12 (2007) 
 
Cholecystokinin receptor type A
Name:Cholecystokinin receptor type A
Type:G Protein-Coupled Receptor (GPCR)
Mol. Mass.:47859.34
Organism:Homo sapiens (Human)
Description:Stable expression of human CCK-1 receptors in HEK 293 cells.
Residue:428
BDBM50002878
NameBDBM50002878
Synonyms:CHEMBL227275
TypeSmall organic molecule
Emp. Form.C32H35N5O5S
Mol. Mass.601.716
SMILESCC(C)(C)C(=O)CN1c2ccccc2C(=NN(CC(=O)Nc2cccc(c2)-c2csc(n2)C(O)=O)C1=O)C1CCCCC1