Reaction Details
TargetGastrin/cholecystokinin type B receptor
LigandBDBM50002895
Substrate/Competitorn/a
Meas. Tech.ChEMBL_439002 (CHEMBL889348)
Ki 1.1±n/a nM
Citation McDonald, IMBlack, JWBuck, IMDunstone, DJGriffin, EPHarper, EAHull, RAKalindjian, SBLilley, EJLinney, IDPether, MJRoberts, SPShaxted, MESpencer, JSteel, KISykes, DAWalker, MKWatt, GFWright, LWright, PTXun, W Optimization of 1,3,4-benzotriazepine-based CCK(2) antagonists to obtain potent, orally active inhibitors of gastrin-mediated gastric acid secretion. J Med Chem50:3101-12 (2007) 
 
Gastrin/cholecystokinin type B receptor
Name:Gastrin/cholecystokinin type B receptor
Type:G Protein-Coupled Receptor (GPCR)
Mol. Mass.:48445.79
Organism:Homo sapiens (Human)
Description:Stable expression of human CCK-2 receptors in HEK 293 cells.
Residue:447
BDBM50002895
NameBDBM50002895
Synonyms:CHEMBL226726
TypeSmall organic molecule
Emp. Form.C31H39N5O5
Mol. Mass.561.6719
SMILESCN(CC(O)=O)c1cccc(NC(=O)CN2N=C(C3CCCCC3)c3ccccc3N(CC(=O)C(C)(C)C)C2=O)c1