Reaction Details
TargetGlucocorticoid receptor
LigandBDBM50411047
Substrate/Competitorn/a
Meas. Tech.ChEMBL_452405 (CHEMBL902641)
IC50 5.25±n/a nM
Citation Biggadike, KBoudjelal, MClackers, MCoe, DMDemaine, DAHardy, GWHumphreys, DInglis, GGJohnston, MJJones, HTHouse, DLoiseau, RNeedham, DSkone, PAUings, IVeitch, GWeingarten, GGMcLay, IMMacdonald, SJ Nonsteroidal glucocorticoid agonists: tetrahydronaphthalenes with alternative steroidal A-ring mimetics possessing dissociated (transrepression/transactivation) efficacy selectivity. J Med Chem50:6519-34 (2007) 
 
Glucocorticoid receptor
Name:Glucocorticoid receptor
Type:Enzyme
Mol. Mass.:85656.87
Organism:Homo sapiens (Human)
Description:P04150
Residue:777
BDBM50411047
NameBDBM50411047
Synonyms:CHEMBL211441
TypeSmall organic molecule
Emp. Form.C28H31F3N2O4
Mol. Mass.516.5519
SMILESCCC(CC)C1(CC(O)(C(=O)Nc2ccc3c(c2)c(C)noc3=O)C(F)(F)F)CCCc2ccccc12