Reaction Details
TargetGlucocorticoid receptor
LigandBDBM50411490
Substrate/Competitorn/a
Meas. Tech.ChEMBL_452406 (CHEMBL902642)
IC50 8.13±n/a nM
Citation Biggadike, KBoudjelal, MClackers, MCoe, DMDemaine, DAHardy, GWHumphreys, DInglis, GGJohnston, MJJones, HTHouse, DLoiseau, RNeedham, DSkone, PAUings, IVeitch, GWeingarten, GGMcLay, IMMacdonald, SJ Nonsteroidal glucocorticoid agonists: tetrahydronaphthalenes with alternative steroidal A-ring mimetics possessing dissociated (transrepression/transactivation) efficacy selectivity. J Med Chem50:6519-34 (2007) 
 
Glucocorticoid receptor
Name:Glucocorticoid receptor
Type:Enzyme
Mol. Mass.:85656.87
Organism:Homo sapiens (Human)
Description:P04150
Residue:777
BDBM50411490
NameBDBM50411490
Synonyms:CHEMBL393819
TypeSmall organic molecule
Emp. Form.C25H26F3NO2
Mol. Mass.429.4746
SMILESCCC1(CC(O)(Cn2ccc(=O)c3ccccc23)C(F)(F)F)CCCc2ccccc12