Reaction Details
TargetGlucocorticoid receptor
LigandBDBM50411481
Substrate/Competitorn/a
Meas. Tech.ChEMBL_452405 (CHEMBL902641)
IC50 74.1±n/a nM
Citation Biggadike, KBoudjelal, MClackers, MCoe, DMDemaine, DAHardy, GWHumphreys, DInglis, GGJohnston, MJJones, HTHouse, DLoiseau, RNeedham, DSkone, PAUings, IVeitch, GWeingarten, GGMcLay, IMMacdonald, SJ Nonsteroidal glucocorticoid agonists: tetrahydronaphthalenes with alternative steroidal A-ring mimetics possessing dissociated (transrepression/transactivation) efficacy selectivity. J Med Chem50:6519-34 (2007) 
 
Glucocorticoid receptor
Name:Glucocorticoid receptor
Type:Enzyme
Mol. Mass.:85656.87
Organism:Homo sapiens (Human)
Description:P04150
Residue:777
BDBM50411481
NameBDBM50411481
Synonyms:CHEMBL393349
TypeSmall organic molecule
Emp. Form.C24H25F3N2O
Mol. Mass.414.4633
SMILESCC1(CC(O)(CNc2cccc3cnccc23)C(F)(F)F)CCCc2ccccc12