Reaction Details
TargetGlucocorticoid receptor
LigandBDBM50411024
Substrate/Competitorn/a
Meas. Tech.ChEMBL_452406 (CHEMBL902642)
IC50 2.04±n/a nM
Citation Biggadike, KBoudjelal, MClackers, MCoe, DMDemaine, DAHardy, GWHumphreys, DInglis, GGJohnston, MJJones, HTHouse, DLoiseau, RNeedham, DSkone, PAUings, IVeitch, GWeingarten, GGMcLay, IMMacdonald, SJ Nonsteroidal glucocorticoid agonists: tetrahydronaphthalenes with alternative steroidal A-ring mimetics possessing dissociated (transrepression/transactivation) efficacy selectivity. J Med Chem50:6519-34 (2007) 
 
Glucocorticoid receptor
Name:Glucocorticoid receptor
Type:Enzyme
Mol. Mass.:85656.87
Organism:Homo sapiens (Human)
Description:P04150
Residue:777
BDBM50411024
NameBDBM50411024
Synonyms:CHEMBL208996
TypeSmall organic molecule
Emp. Form.C28H29F3N2O4
Mol. Mass.514.5361
SMILESCc1noc(=O)c2ccc(NC(=O)[C@](O)(C[C@]3(CCCc4ccccc34)C3CCCC3)C(F)(F)F)cc12