Reaction Details
TargetProstaglandin E2 receptor EP1 subtype
LigandBDBM50412216
Substrate/Competitorn/a
Meas. Tech.ChEMBL_487568 (CHEMBL1022751)
IC50 12.59±n/a nM
Citation Hall, ABillinton, ABristow, AKBrown, SHChowdhury, ACutler, LGiblin, GMGoldsmith, PHayhow, TGKilford, IRNaylor, APassingham, BRawlings, DA Discovery of brain penetrant, soluble, pyrazole amide EP1 receptor antagonists. Bioorg Med Chem Lett18:4027-32 (2008) 
 
Prostaglandin E2 receptor EP1 subtype
Name:Prostaglandin E2 receptor EP1 subtype
Type:Enzyme
Mol. Mass.:41834.57
Organism:Homo sapiens (Human)
Description:P34995
Residue:402
BDBM50412216
NameBDBM50412216
Synonyms:CHEMBL447709
TypeSmall organic molecule
Emp. Form.C23H26ClN3O3
Mol. Mass.427.924
SMILESCC(C)COc1ccc(Cl)cc1Cn1nc(NC(=O)c2ccc(CO)cc2)cc1C