Reaction Details
TargetProstaglandin E2 receptor EP1 subtype
LigandBDBM50412226
Substrate/Competitorn/a
Meas. Tech.ChEMBL_487568 (CHEMBL1022751)
IC50 10±n/a nM
Citation Hall, ABillinton, ABristow, AKBrown, SHChowdhury, ACutler, LGiblin, GMGoldsmith, PHayhow, TGKilford, IRNaylor, APassingham, BRawlings, DA Discovery of brain penetrant, soluble, pyrazole amide EP1 receptor antagonists. Bioorg Med Chem Lett18:4027-32 (2008) 
 
Prostaglandin E2 receptor EP1 subtype
Name:Prostaglandin E2 receptor EP1 subtype
Type:Enzyme
Mol. Mass.:41834.57
Organism:Homo sapiens (Human)
Description:P34995
Residue:402
BDBM50412226
NameBDBM50412226
Synonyms:CHEMBL404525
TypeSmall organic molecule
Emp. Form.C19H16ClN2O3
Mol. Mass.355.795
SMILESCc1cc(nn1Cc1cc(Cl)ccc1OCc1ccccc1)C([O-])=O