Reaction Details
TargetProstaglandin E2 receptor EP1 subtype
LigandBDBM50412233
Substrate/Competitorn/a
Meas. Tech.ChEMBL_487569 (CHEMBL1022752)
Ki 100±n/a nM
Citation Hall, ABillinton, ABristow, AKBrown, SHChowdhury, ACutler, LGiblin, GMGoldsmith, PHayhow, TGKilford, IRNaylor, APassingham, BRawlings, DA Discovery of brain penetrant, soluble, pyrazole amide EP1 receptor antagonists. Bioorg Med Chem Lett18:4027-32 (2008) 
 
Prostaglandin E2 receptor EP1 subtype
Name:Prostaglandin E2 receptor EP1 subtype
Type:Enzyme
Mol. Mass.:41834.57
Organism:Homo sapiens (Human)
Description:P34995
Residue:402
BDBM50412233
NameBDBM50412233
Synonyms:CHEMBL495107
TypeSmall organic molecule
Emp. Form.C25H31ClN4O3
Mol. Mass.470.992
SMILESCC(C)COc1ccc(Cl)cc1Cn1nc(cc1C)C(=O)Nc1ccc(CNCCO)cc1