Reaction Details
TargetHistamine H4 receptor
LigandBDBM50397291
Substrate/Competitorn/a
Meas. Tech.ChEMBL_556996 (CHEMBL958182)
Ki 7585.78±n/a nM
Citation Smits, RAde Esch, IJZuiderveld, OPBroeker, JSansuk, KGuaita, ECoruzzi, GAdami, MHaaksma, ELeurs, R Discovery of quinazolines as histamine H4 receptor inverse agonists using a scaffold hopping approach. J Med Chem51:7855-65 (2008) 
 
Histamine H4 receptor
Name:Histamine H4 receptor
Type:G Protein-Coupled Receptor (GPCR)
Mol. Mass.:44517.02
Organism:Homo sapiens (Human)
Description:Binding assays were using CHO cells stably expressing hH4R receptors.
Residue:390
BDBM50397291
NameBDBM50397291
Synonyms:CHEMBL443764 | VUF-10249
TypeSmall organic molecule
Emp. Form.C13H16N4
Mol. Mass.228.2929
SMILESCN1CCN(CC1)c1ncc2ccccc2n1