Reaction Details
TargetHistamine H4 receptor
LigandBDBM50412499
Substrate/Competitorn/a
Meas. Tech.ChEMBL_556996 (CHEMBL958182)
Ki 8511.38±n/a nM
Citation Smits, RAde Esch, IJZuiderveld, OPBroeker, JSansuk, KGuaita, ECoruzzi, GAdami, MHaaksma, ELeurs, R Discovery of quinazolines as histamine H4 receptor inverse agonists using a scaffold hopping approach. J Med Chem51:7855-65 (2008) 
 
Histamine H4 receptor
Name:Histamine H4 receptor
Type:G Protein-Coupled Receptor (GPCR)
Mol. Mass.:44517.02
Organism:Homo sapiens (Human)
Description:Binding assays were using CHO cells stably expressing hH4R receptors.
Residue:390
BDBM50412499
NameBDBM50412499
Synonyms:CHEMBL515870 | VUF-10247
TypeSmall organic molecule
Emp. Form.C19H21N5
Mol. Mass.319.4035
SMILESCN1CCN(CC1)c1nc(Nc2ccccc2)c2ccccc2n1