Reaction Details
TargetHistamine H4 receptor
LigandBDBM50412509
Substrate/Competitorn/a
Meas. Tech.ChEMBL_556996 (CHEMBL958182)
Ki 602.56±n/a nM
Citation Smits, RAde Esch, IJZuiderveld, OPBroeker, JSansuk, KGuaita, ECoruzzi, GAdami, MHaaksma, ELeurs, R Discovery of quinazolines as histamine H4 receptor inverse agonists using a scaffold hopping approach. J Med Chem51:7855-65 (2008) 
 
Histamine H4 receptor
Name:Histamine H4 receptor
Type:G Protein-Coupled Receptor (GPCR)
Mol. Mass.:44517.02
Organism:Homo sapiens (Human)
Description:Binding assays were using CHO cells stably expressing hH4R receptors.
Residue:390
BDBM50412509
NameBDBM50412509
Synonyms:CHEMBL455133 | VUF-10501
TypeSmall organic molecule
Emp. Form.C18H21N5O
Mol. Mass.323.3922
SMILESCN1CCN(CC1)c1nc(NCc2ccco2)c2ccccc2n1