Reaction Details
TargetHistamine H4 receptor
LigandBDBM50412516
Substrate/Competitorn/a
Meas. Tech.ChEMBL_556996 (CHEMBL958182)
Ki 33.88±n/a nM
Citation Smits, RAde Esch, IJZuiderveld, OPBroeker, JSansuk, KGuaita, ECoruzzi, GAdami, MHaaksma, ELeurs, R Discovery of quinazolines as histamine H4 receptor inverse agonists using a scaffold hopping approach. J Med Chem51:7855-65 (2008) 
 
Histamine H4 receptor
Name:Histamine H4 receptor
Type:G Protein-Coupled Receptor (GPCR)
Mol. Mass.:44517.02
Organism:Homo sapiens (Human)
Description:Binding assays were using CHO cells stably expressing hH4R receptors.
Residue:390
BDBM50412516
NameBDBM50412516
Synonyms:CHEMBL509852 | VUF-10515
TypeSmall organic molecule
Emp. Form.C19H22ClN5S
Mol. Mass.387.929
SMILESCN1CCN(CC1)c1nc(NCc2sccc2C)c2cc(Cl)ccc2n1