Reaction Details
TargetCorticotropin-releasing factor receptor 1
LigandBDBM50116105
Substrate/Competitorn/a
Meas. Tech.ChEMBL_494923 (CHEMBL1004666)
IC50 28.18±n/a nM
Citation Di Fabio, RSt-Denis, YSabbatini, FMAndreotti, DArban, RBernasconi, GBraggio, SBlaney, FECapelli, AMCastiglioni, EDi Modugno, EDonati, DFazzolari, ERatti, EFeriani, AContini, SGentile, GGhirlanda, DProvera, SMarchioro, CRoberts, KLMingardi, AMattioli, MNalin, APavone, FSpada, STrist, DGWorby, A Synthesis and pharmacological characterization of novel druglike corticotropin-releasing factor 1 antagonists. J Med Chem51:7370-9 (2009) 
 
Corticotropin-releasing factor receptor 1
Name:Corticotropin-releasing factor receptor 1
Type:Enzyme
Mol. Mass.:50744.31
Organism:Homo sapiens (Human)
Description:P34998
Residue:444
BDBM50116105
NameBDBM50116105
Synonyms:3-(6-(dimethylamino)-4-methylpyridin-3-yl)-2,5-dimethyl-N,N-dipropylpyrazolo[1,5-a]pyrimidin-7-amine R-121919 [3-(6-Dimethylamino-4-methyl-pyridin-3-yl)-2,5-dimethyl-pyrazolo[1,5-a]pyrimidin-7-yl]-dipropyl-amine
TypeSmall organic molecule
Emp. Form.C22H32N6
Mol. Mass.380.5297
SMILESCCCN(CCC)c1cc(C)nc2c(c(C)nn12)-c1cnc(cc1C)N(C)C