Reaction Details
TargetCorticotropin-releasing factor receptor 1
LigandBDBM50084875
Substrate/Competitorn/a
Meas. Tech.ChEMBL_494923 (CHEMBL1004666)
IC50 39.81±n/a nM
Citation Di Fabio, RSt-Denis, YSabbatini, FMAndreotti, DArban, RBernasconi, GBraggio, SBlaney, FECapelli, AMCastiglioni, EDi Modugno, EDonati, DFazzolari, ERatti, EFeriani, AContini, SGentile, GGhirlanda, DProvera, SMarchioro, CRoberts, KLMingardi, AMattioli, MNalin, APavone, FSpada, STrist, DGWorby, A Synthesis and pharmacological characterization of novel druglike corticotropin-releasing factor 1 antagonists. J Med Chem51:7370-9 (2009) 
 
Corticotropin-releasing factor receptor 1
Name:Corticotropin-releasing factor receptor 1
Type:Enzyme
Mol. Mass.:50744.31
Organism:Homo sapiens (Human)
Description:P34998
Residue:444
BDBM50084875
NameBDBM50084875
Synonyms:8-(2,4-dichlorophenyl)-N-(1,3-dimethoxypropan-2-yl)-2,7-dimethylpyrazolo[1,5-a][1,3,5]triazin-4-amine DMP-696 [8-(2,4-dichloro-phenyl)-2,7-dimethyl-pyrazolo[1,5-a][1,3,5]triazin-4-yl]-(2-methoxy-1-methoxymethyl-ethyl)-amine
TypeSmall organic molecule
Emp. Form.C18H21Cl2N5O2
Mol. Mass.410.298
SMILESCOCC(COC)Nc1nc(C)nc2c(c(C)nn12)-c1ccc(Cl)cc1Cl