Reaction Details
TargetCorticotropin-releasing factor receptor 1
LigandBDBM50412804
Substrate/Competitorn/a
Meas. Tech.ChEMBL_494923 (CHEMBL1004666)
IC50 309.03±n/a nM
Citation Di Fabio, RSt-Denis, YSabbatini, FMAndreotti, DArban, RBernasconi, GBraggio, SBlaney, FECapelli, AMCastiglioni, EDi Modugno, EDonati, DFazzolari, ERatti, EFeriani, AContini, SGentile, GGhirlanda, DProvera, SMarchioro, CRoberts, KLMingardi, AMattioli, MNalin, APavone, FSpada, STrist, DGWorby, A Synthesis and pharmacological characterization of novel druglike corticotropin-releasing factor 1 antagonists. J Med Chem51:7370-9 (2009) 
 
Corticotropin-releasing factor receptor 1
Name:Corticotropin-releasing factor receptor 1
Type:Enzyme
Mol. Mass.:50744.31
Organism:Homo sapiens (Human)
Description:P34998
Residue:444
BDBM50412804
NameBDBM50412804
Synonyms:CHEMBL456449
TypeSmall organic molecule
Emp. Form.C21H24N6O3S
Mol. Mass.440.519
SMILESCOc1ccc(N2CCc3c2nc(C)cc3-n2ccc(n2)N2CCNS2(=O)=O)c(C)c1