Reaction Details
TargetCorticotropin-releasing factor receptor 1
LigandBDBM50412811
Substrate/Competitorn/a
Meas. Tech.ChEMBL_494923 (CHEMBL1004666)
IC50 32.36±n/a nM
Citation Di Fabio, RSt-Denis, YSabbatini, FMAndreotti, DArban, RBernasconi, GBraggio, SBlaney, FECapelli, AMCastiglioni, EDi Modugno, EDonati, DFazzolari, ERatti, EFeriani, AContini, SGentile, GGhirlanda, DProvera, SMarchioro, CRoberts, KLMingardi, AMattioli, MNalin, APavone, FSpada, STrist, DGWorby, A Synthesis and pharmacological characterization of novel druglike corticotropin-releasing factor 1 antagonists. J Med Chem51:7370-9 (2009) 
 
Corticotropin-releasing factor receptor 1
Name:Corticotropin-releasing factor receptor 1
Type:Enzyme
Mol. Mass.:50744.31
Organism:Homo sapiens (Human)
Description:P34998
Residue:444
BDBM50412811
NameBDBM50412811
Synonyms:CHEMBL458810
TypeSmall organic molecule
Emp. Form.C22H18F3N7O
Mol. Mass.453.4198
SMILESCc1cc(c2CCN(c2n1)c1ccc(cc1C(F)(F)F)C#N)-n1ccc(n1)N1CCNC1=O