Reaction Details
TargetCorticotropin-releasing factor receptor 1
LigandBDBM50412812
Substrate/Competitorn/a
Meas. Tech.ChEMBL_494923 (CHEMBL1004666)
IC50 56.23±n/a nM
Citation Di Fabio, RSt-Denis, YSabbatini, FMAndreotti, DArban, RBernasconi, GBraggio, SBlaney, FECapelli, AMCastiglioni, EDi Modugno, EDonati, DFazzolari, ERatti, EFeriani, AContini, SGentile, GGhirlanda, DProvera, SMarchioro, CRoberts, KLMingardi, AMattioli, MNalin, APavone, FSpada, STrist, DGWorby, A Synthesis and pharmacological characterization of novel druglike corticotropin-releasing factor 1 antagonists. J Med Chem51:7370-9 (2009) 
 
Corticotropin-releasing factor receptor 1
Name:Corticotropin-releasing factor receptor 1
Type:Enzyme
Mol. Mass.:50744.31
Organism:Homo sapiens (Human)
Description:P34998
Residue:444
BDBM50412812
NameBDBM50412812
Synonyms:CHEMBL459173
TypeSmall organic molecule
Emp. Form.C22H22F2N6O2
Mol. Mass.440.4459
SMILESCOc1ccc(N2CCc3c2nc(C)cc3-n2ccc(n2)N2CCNC2=O)c(c1)C(F)F