Reaction Details
TargetCorticotropin-releasing factor receptor 1
LigandBDBM50412815
Substrate/Competitorn/a
Meas. Tech.ChEMBL_494923 (CHEMBL1004666)
IC50 363.08±n/a nM
Citation Di Fabio, RSt-Denis, YSabbatini, FMAndreotti, DArban, RBernasconi, GBraggio, SBlaney, FECapelli, AMCastiglioni, EDi Modugno, EDonati, DFazzolari, ERatti, EFeriani, AContini, SGentile, GGhirlanda, DProvera, SMarchioro, CRoberts, KLMingardi, AMattioli, MNalin, APavone, FSpada, STrist, DGWorby, A Synthesis and pharmacological characterization of novel druglike corticotropin-releasing factor 1 antagonists. J Med Chem51:7370-9 (2009) 
 
Corticotropin-releasing factor receptor 1
Name:Corticotropin-releasing factor receptor 1
Type:Enzyme
Mol. Mass.:50744.31
Organism:Homo sapiens (Human)
Description:P34998
Residue:444
BDBM50412815
NameBDBM50412815
Synonyms:CHEMBL457742
TypeSmall organic molecule
Emp. Form.C24H22N8O2
Mol. Mass.454.4839
SMILESCOc1cc(ccc1N1CCc2c1nc(C)cc2-n1ccc(n1)-n1cc[nH]c1=O)-n1cccn1