Reaction Details
TargetCorticotropin-releasing factor receptor 1
LigandBDBM50412816
Substrate/Competitorn/a
Meas. Tech.ChEMBL_494923 (CHEMBL1004666)
IC50 158.49±n/a nM
Citation Di Fabio, RSt-Denis, YSabbatini, FMAndreotti, DArban, RBernasconi, GBraggio, SBlaney, FECapelli, AMCastiglioni, EDi Modugno, EDonati, DFazzolari, ERatti, EFeriani, AContini, SGentile, GGhirlanda, DProvera, SMarchioro, CRoberts, KLMingardi, AMattioli, MNalin, APavone, FSpada, STrist, DGWorby, A Synthesis and pharmacological characterization of novel druglike corticotropin-releasing factor 1 antagonists. J Med Chem51:7370-9 (2009) 
 
Corticotropin-releasing factor receptor 1
Name:Corticotropin-releasing factor receptor 1
Type:Enzyme
Mol. Mass.:50744.31
Organism:Homo sapiens (Human)
Description:P34998
Residue:444
BDBM50412816
NameBDBM50412816
Synonyms:CHEMBL464184
TypeSmall organic molecule
Emp. Form.C20H16Cl2N6O
Mol. Mass.427.287
SMILESCc1cc(c2CCN(c2n1)c1ccc(Cl)cc1Cl)-n1ccc(n1)-n1cc[nH]c1=O