Reaction Details
TargetCorticotropin-releasing factor receptor 1
LigandBDBM50412817
Substrate/Competitorn/a
Meas. Tech.ChEMBL_494923 (CHEMBL1004666)
IC50 89.13±n/a nM
Citation Di Fabio, RSt-Denis, YSabbatini, FMAndreotti, DArban, RBernasconi, GBraggio, SBlaney, FECapelli, AMCastiglioni, EDi Modugno, EDonati, DFazzolari, ERatti, EFeriani, AContini, SGentile, GGhirlanda, DProvera, SMarchioro, CRoberts, KLMingardi, AMattioli, MNalin, APavone, FSpada, STrist, DGWorby, A Synthesis and pharmacological characterization of novel druglike corticotropin-releasing factor 1 antagonists. J Med Chem51:7370-9 (2009) 
 
Corticotropin-releasing factor receptor 1
Name:Corticotropin-releasing factor receptor 1
Type:Enzyme
Mol. Mass.:50744.31
Organism:Homo sapiens (Human)
Description:P34998
Residue:444
BDBM50412817
NameBDBM50412817
Synonyms:CHEMBL464185
TypeSmall organic molecule
Emp. Form.C22H16F6N6O
Mol. Mass.494.3925
SMILESCc1cc(c2CCN(c2n1)c1ccc(cc1C(F)(F)F)C(F)(F)F)-n1ccc(n1)-n1cc[nH]c1=O