Reaction Details
TargetMuscarinic acetylcholine receptor M2
LigandBDBM50413103
Substrate/Competitorn/a
Meas. Tech.ChEMBL_496880 (CHEMBL998549)
IC50 2.51±n/a nM
Citation Jin, JWang, YShi, DWang, FFu, WDavis, RSJin, QFoley, JJSarau, HMMorrow, DMMoore, MLRivero, RAPalovich, MSalmon, MBelmonte, KEBusch-Petersen, J Muscarinic acetylcholine receptor antagonists: SAR and optimization of tyrosine ureas. Bioorg Med Chem Lett18:5481-6 (2008) 
 
Muscarinic acetylcholine receptor M2
Name:Muscarinic acetylcholine receptor M2
Type:GPCR
Mol. Mass.:51730.61
Organism:Homo sapiens (Human)
Description:P08172
Residue:466
BDBM50413103
NameBDBM50413103
Synonyms:CHEMBL555474
TypeSmall organic molecule
Emp. Form.C32H38FN4O5
Mol. Mass.577.6658
SMILESCCOC(=O)c1ccc(NC(=O)N[C@@H](Cc2ccc(O)cc2)C(=O)N[C@H]2CCC[N+](C)(Cc3ccc(F)cc3)C2)cc1