Reaction Details
TargetMuscarinic acetylcholine receptor M3
LigandBDBM50413103
Substrate/Competitorn/a
Meas. Tech.ChEMBL_496878 (CHEMBL998547)
IC50 2±n/a nM
Citation Jin, JWang, YShi, DWang, FFu, WDavis, RSJin, QFoley, JJSarau, HMMorrow, DMMoore, MLRivero, RAPalovich, MSalmon, MBelmonte, KEBusch-Petersen, J Muscarinic acetylcholine receptor antagonists: SAR and optimization of tyrosine ureas. Bioorg Med Chem Lett18:5481-6 (2008) 
 
Muscarinic acetylcholine receptor M3
Name:Muscarinic acetylcholine receptor M3
Type:Enzyme
Mol. Mass.:66151.03
Organism:Homo sapiens (Human)
Description:P20309
Residue:590
BDBM50413103
NameBDBM50413103
Synonyms:CHEMBL555474
TypeSmall organic molecule
Emp. Form.C32H38FN4O5
Mol. Mass.577.6658
SMILESCCOC(=O)c1ccc(NC(=O)N[C@@H](Cc2ccc(O)cc2)C(=O)N[C@H]2CCC[N+](C)(Cc3ccc(F)cc3)C2)cc1