Reaction Details
TargetMuscarinic acetylcholine receptor M3
LigandBDBM50413113
Substrate/Competitorn/a
Meas. Tech.ChEMBL_496878 (CHEMBL998547)
Kd 0.631±n/a nM
Citation Jin, JWang, YShi, DWang, FFu, WDavis, RSJin, QFoley, JJSarau, HMMorrow, DMMoore, MLRivero, RAPalovich, MSalmon, MBelmonte, KEBusch-Petersen, J Muscarinic acetylcholine receptor antagonists: SAR and optimization of tyrosine ureas. Bioorg Med Chem Lett18:5481-6 (2008) 
 
Muscarinic acetylcholine receptor M3
Name:Muscarinic acetylcholine receptor M3
Type:Enzyme
Mol. Mass.:66151.03
Organism:Homo sapiens (Human)
Description:P20309
Residue:590
BDBM50413113
NameBDBM50413113
Synonyms:CHEMBL555706
TypeSmall organic molecule
Emp. Form.C33H42N5O5
Mol. Mass.588.7165
SMILESCC(C)NC(=O)c1ccc(NC(=O)N[C@@H](Cc2ccc(O)cc2)C(=O)N[C@H]2CCC[N+](C)(Cc3ccc(O)cc3)C2)cc1