Reaction Details
TargetMuscarinic acetylcholine receptor M2
LigandBDBM50413138
Substrate/Competitorn/a
Meas. Tech.ChEMBL_496880 (CHEMBL998549)
IC50 10±n/a nM
Citation Jin, JWang, YShi, DWang, FFu, WDavis, RSJin, QFoley, JJSarau, HMMorrow, DMMoore, MLRivero, RAPalovich, MSalmon, MBelmonte, KEBusch-Petersen, J Muscarinic acetylcholine receptor antagonists: SAR and optimization of tyrosine ureas. Bioorg Med Chem Lett18:5481-6 (2008) 
 
Muscarinic acetylcholine receptor M2
Name:Muscarinic acetylcholine receptor M2
Type:GPCR
Mol. Mass.:51730.61
Organism:Homo sapiens (Human)
Description:P08172
Residue:466
BDBM50413138
NameBDBM50413138
Synonyms:CHEMBL527216
TypeSmall organic molecule
Emp. Form.C32H36FN4O6
Mol. Mass.591.6493
SMILESCCOC(=O)c1ccc(NC(=O)N[C@@H](Cc2ccc(F)cc2)C(=O)N[C@H]2CC[N+](C)(Cc3ccc4OCOc4c3)C2)cc1