Reaction Details
TargetMuscarinic acetylcholine receptor M1
LigandBDBM50412340
Substrate/Competitorn/a
Meas. Tech.ChEMBL_496879 (CHEMBL998548)
Kd 15.85±n/a nM
Citation Jin, JWang, YShi, DWang, FFu, WDavis, RSJin, QFoley, JJSarau, HMMorrow, DMMoore, MLRivero, RAPalovich, MSalmon, MBelmonte, KEBusch-Petersen, J Muscarinic acetylcholine receptor antagonists: SAR and optimization of tyrosine ureas. Bioorg Med Chem Lett18:5481-6 (2008) 
 
Muscarinic acetylcholine receptor M1
Name:Muscarinic acetylcholine receptor M1
Type:Protein
Mol. Mass.:51442.54
Organism:Homo sapiens (Human)
Description:P11229
Residue:460
BDBM50412340
NameBDBM50412340
Synonyms:CHEMBL540359
TypeSmall organic molecule
Emp. Form.C33H41N4O6
Mol. Mass.589.7013
SMILESCC(C)OC(=O)c1ccc(NC(=O)N[C@@H](Cc2ccc(O)cc2)C(=O)N[C@H]2CCC[N+](C)(Cc3cccc(O)c3)C2)cc1