Reaction Details
TargetMuscarinic acetylcholine receptor M3
LigandBDBM50413137
Substrate/Competitorn/a
Meas. Tech.ChEMBL_496878 (CHEMBL998547)
IC50 10±n/a nM
Citation Jin, JWang, YShi, DWang, FFu, WDavis, RSJin, QFoley, JJSarau, HMMorrow, DMMoore, MLRivero, RAPalovich, MSalmon, MBelmonte, KEBusch-Petersen, J Muscarinic acetylcholine receptor antagonists: SAR and optimization of tyrosine ureas. Bioorg Med Chem Lett18:5481-6 (2008) 
 
Muscarinic acetylcholine receptor M3
Name:Muscarinic acetylcholine receptor M3
Type:Enzyme
Mol. Mass.:66151.03
Organism:Homo sapiens (Human)
Description:P20309
Residue:590
BDBM50413137
NameBDBM50413137
Synonyms:CHEMBL555019
TypeSmall organic molecule
Emp. Form.C32H36ClN4O6
Mol. Mass.608.104
SMILESCCOC(=O)c1ccc(NC(=O)N[C@@H](Cc2ccc(Cl)cc2)C(=O)N[C@H]2CC[N+](C)(Cc3ccc4OCOc4c3)C2)cc1