Reaction Details
TargetC5a anaphylatoxin chemotactic receptor 1
LigandBDBM50413240
Substrate/Competitorn/a
Meas. Tech.ChEMBL_541070 (CHEMBL1024770)
IC50 39.81±n/a nM
Citation Sanganee, HJBaxter, ABarber, SBrown, AJGrice, DHunt, FKing, SLaughton, DPairaudeau, GThong, BWeaver, RUnitt, J Discovery of small molecule human C5a receptor antagonists. Bioorg Med Chem Lett19:1143-7 (2009) 
 
C5a anaphylatoxin chemotactic receptor 1
Name:C5a anaphylatoxin chemotactic receptor 1
Type:Enzyme
Mol. Mass.:39347.68
Organism:Homo sapiens (Human)
Description:P21730
Residue:350
BDBM50413240
NameBDBM50413240
Synonyms:CHEMBL471412
TypeSmall organic molecule
Emp. Form.C28H29FN2O4
Mol. Mass.476.5393
SMILESCOc1ccc(N(C(C(=O)NC2CCCC2)c2ccccc2F)C(=O)c2ccccc2)c(OC)c1