Reaction Details
TargetC5a anaphylatoxin chemotactic receptor 1
LigandBDBM50413249
Substrate/Competitorn/a
Meas. Tech.ChEMBL_541063 (CHEMBL1024763)
IC50 794.33±n/a nM
Citation Sanganee, HJBaxter, ABarber, SBrown, AJGrice, DHunt, FKing, SLaughton, DPairaudeau, GThong, BWeaver, RUnitt, J Discovery of small molecule human C5a receptor antagonists. Bioorg Med Chem Lett19:1143-7 (2009) 
 
C5a anaphylatoxin chemotactic receptor 1
Name:C5a anaphylatoxin chemotactic receptor 1
Type:Enzyme
Mol. Mass.:39347.68
Organism:Homo sapiens (Human)
Description:P21730
Residue:350
BDBM50413249
NameBDBM50413249
Synonyms:CHEMBL450470
TypeSmall organic molecule
Emp. Form.C23H27FN2O4
Mol. Mass.414.4699
SMILESCOc1ccc(N(C(C(=O)NC2CCCC2)c2ccccc2F)C(C)=O)c(OC)c1