Reaction Details
TargetcAMP-specific 3',5'-cyclic phosphodiesterase 4B
LigandBDBM50413282
Substrate/Competitorn/a
Meas. Tech.ChEMBL_565939 (CHEMBL960834)
IC50 100±n/a nM
Citation Lunniss, CJCooper, AWEldred, CDKranz, MLindvall, MLucas, FSNeu, MPreston, AGRanshaw, LERedgrave, AJEd Robinson, JShipley, TJSolanke, YESomers, DOWiseman, JO Quinolines as a novel structural class of potent and selective PDE4 inhibitors: optimisation for oral administration. Bioorg Med Chem Lett19:1380-5 (2009) 
 
cAMP-specific 3',5'-cyclic phosphodiesterase 4B
Name:cAMP-specific 3',5'-cyclic phosphodiesterase 4B
Type:Protein
Mol. Mass.:83318.87
Organism:Homo sapiens (Human)
Description:Q07343
Residue:736
BDBM50413282
NameBDBM50413282
Synonyms:CHEMBL517900
TypeSmall organic molecule
Emp. Form.C17H15N3O4S
Mol. Mass.357.384
SMILESCS(=O)(=O)c1ccc2ncc(C(N)=O)c(Nc3cccc(O)c3)c2c1