Reaction Details
TargetcAMP-specific 3',5'-cyclic phosphodiesterase 4B
LigandBDBM50413286
Substrate/Competitorn/a
Meas. Tech.ChEMBL_565939 (CHEMBL960834)
IC50 2.51±n/a nM
Citation Lunniss, CJCooper, AWEldred, CDKranz, MLindvall, MLucas, FSNeu, MPreston, AGRanshaw, LERedgrave, AJEd Robinson, JShipley, TJSolanke, YESomers, DOWiseman, JO Quinolines as a novel structural class of potent and selective PDE4 inhibitors: optimisation for oral administration. Bioorg Med Chem Lett19:1380-5 (2009) 
 
cAMP-specific 3',5'-cyclic phosphodiesterase 4B
Name:cAMP-specific 3',5'-cyclic phosphodiesterase 4B
Type:Protein
Mol. Mass.:83318.87
Organism:Homo sapiens (Human)
Description:Q07343
Residue:736
BDBM50413286
NameBDBM50413286
Synonyms:CHEMBL517766
TypeSmall organic molecule
Emp. Form.C19H17N3O4S
Mol. Mass.383.421
SMILESCS(=O)(=O)c1ccc2ncc(C(N)=O)c(Nc3cccc4OCCc34)c2c1