Reaction Details
TargetcAMP-specific 3',5'-cyclic phosphodiesterase 4B
LigandBDBM50413301
Substrate/Competitorn/a
Meas. Tech.ChEMBL_565939 (CHEMBL960834)
IC50 31.62±n/a nM
Citation Lunniss, CJCooper, AWEldred, CDKranz, MLindvall, MLucas, FSNeu, MPreston, AGRanshaw, LERedgrave, AJEd Robinson, JShipley, TJSolanke, YESomers, DOWiseman, JO Quinolines as a novel structural class of potent and selective PDE4 inhibitors: optimisation for oral administration. Bioorg Med Chem Lett19:1380-5 (2009) 
 
cAMP-specific 3',5'-cyclic phosphodiesterase 4B
Name:cAMP-specific 3',5'-cyclic phosphodiesterase 4B
Type:Protein
Mol. Mass.:83318.87
Organism:Homo sapiens (Human)
Description:Q07343
Residue:736
BDBM50413301
NameBDBM50413301
Synonyms:CHEMBL461111
TypeSmall organic molecule
Emp. Form.C18H16FN3O4S
Mol. Mass.389.401
SMILESCOc1cc(Nc2c(cnc3ccc(cc23)S(C)(=O)=O)C(N)=O)ccc1F