Reaction Details
TargetMas-related G-protein coupled receptor member X2
LigandBDBM50413340
Substrate/Competitorn/a
Meas. Tech.ChEMBL_562320 (CHEMBL1015294)
EC50 501±n/a nM
Citation Malik, LKelly, NMMa, JNCurrier, EABurstein, ESOlsson, R Discovery of non-peptidergic MrgX1 and MrgX2 receptor agonists and exploration of an initial SAR using solid-phase synthesis. Bioorg Med Chem Lett19:1729-32 (2009) 
 
Mas-related G-protein coupled receptor member X2
Name:Mas-related G-protein coupled receptor member X2
Type:GPCR
Mol. Mass.:37104.79
Organism:Homo sapiens (Human)
Description:Q96LB1
Residue:330
BDBM50413340
NameBDBM50413340
Synonyms:CHEMBL505715
TypeSmall organic molecule
Emp. Form.C81H113N19O19S2
Mol. Mass.1721.01
SMILESC[C@@H](O)[C@@H]1NC(=O)[C@@H](CCCCN)NC(=O)[C@H](Cc2c[nH]c3ccccc23)NC(=O)[C@H](Cc2ccccc2)NC(=O)[C@H](Cc2ccccc2)NC(=O)[C@H](CC(N)=O)NC(=O)[C@H](CCCCN)NC(=O)[C@H](CSSC[C@H](NC(=O)[C@H](CO)NC(=O)[C@H](CO)NC(=O)[C@@H](Cc2ccccc2)NC1=O)C(=O)N[C@@H](CCCCN)C(O)=O)NC(=O)[C@@H]1CCCN1