Reaction Details
TargetMuscarinic acetylcholine receptor M3
LigandBDBM50413464
Substrate/Competitorn/a
Meas. Tech.ChEMBL_562388 (CHEMBL1018821)
Kd 3.16±n/a nM
Citation Budzik, BWang, YShi, DWang, FXie, HWan, ZZhu, CFoley, JJNuthulaganti, PKallal, LASarau, HMMorrow, DMMoore, MLRivero, RAPalovich, MSalmon, MBelmonte, KELaine, DIJin, J M3 muscarinic acetylcholine receptor antagonists: SAR and optimization of bi-aryl amines. Bioorg Med Chem Lett19:1686-90 (2009) 
 
Muscarinic acetylcholine receptor M3
Name:Muscarinic acetylcholine receptor M3
Type:Enzyme
Mol. Mass.:66151.03
Organism:Homo sapiens (Human)
Description:P20309
Residue:590
BDBM50413464
NameBDBM50413464
Synonyms:CHEMBL494022
TypeSmall organic molecule
Emp. Form.C29H35FN4O
Mol. Mass.474.6128
SMILESCC1CN(Cc2cccc(c2)-c2cc(CNC(=O)c3cccc(CN(C)C)c3)ccc2F)CCN1