Reaction Details
TargetMuscarinic acetylcholine receptor M1
LigandBDBM50412728
Substrate/Competitorn/a
Meas. Tech.ChEMBL_562391 (CHEMBL1018824)
Kd 0.2±n/a nM
Citation Budzik, BWang, YShi, DWang, FXie, HWan, ZZhu, CFoley, JJNuthulaganti, PKallal, LASarau, HMMorrow, DMMoore, MLRivero, RAPalovich, MSalmon, MBelmonte, KELaine, DIJin, J M3 muscarinic acetylcholine receptor antagonists: SAR and optimization of bi-aryl amines. Bioorg Med Chem Lett19:1686-90 (2009) 
 
Muscarinic acetylcholine receptor M1
Name:Muscarinic acetylcholine receptor M1
Type:Protein
Mol. Mass.:51442.54
Organism:Homo sapiens (Human)
Description:P11229
Residue:460
BDBM50412728
NameBDBM50412728
Synonyms:CHEMBL521523
TypeSmall organic molecule
Emp. Form.C32H39FN4O
Mol. Mass.514.6767
SMILESC[C@H]1CN(Cc2cccc(c2)-c2cc(CNC(=O)c3cccc(CC4CCNCC4)c3)ccc2F)CCN1