Reaction Details
TargetC-X-C chemokine receptor type 3
LigandBDBM50413589
Substrate/Competitorn/a
Meas. Tech.ChEMBL_497564 (CHEMBL998621)
Ki 501.19±n/a nM
Citation Wijtmans, MVerzijl, Dvan Dam, CMBosch, LSmit, MJLeurs, Rde Esch, IJ Exploring a pocket for polycycloaliphatic groups in the CXCR3 receptor with the aid of a modular synthetic strategy. Bioorg Med Chem Lett19:2252-7 (2009) 
 
C-X-C chemokine receptor type 3
Name:C-X-C chemokine receptor type 3
Type:Enzyme Catalytic Domain
Mol. Mass.:40665.65
Organism:Homo sapiens (Human)
Description:n/a
Residue:368
BDBM50413589
NameBDBM50413589
Synonyms:CHEMBL470407
TypeSmall organic molecule
Emp. Form.C22H33ClN2
Mol. Mass.360.964
SMILESCC1(C)[C@@H]2CC[C@@]1(C)[C@@H](C2)NC1CCN(Cc2ccc(Cl)cc2)CC1