Reaction Details
TargetGlucocorticoid receptor
LigandBDBM50414615
Substrate/Competitorn/a
Meas. Tech.ChEMBL_580474 (CHEMBL1052501)
IC50 0.398±n/a nM
Citation Biggadike, KCaivano, MClackers, MCoe, DMHardy, GWHumphreys, DJones, HTHouse, DMiles-Williams, ASkone, PAUings, IWeller, VMcLay, IMMacdonald, SJ Highly tractable, sub-nanomolar non-steroidal glucocorticoid receptor agonists. Bioorg Med Chem Lett19:4846-50 (2009) 
 
Glucocorticoid receptor
Name:Glucocorticoid receptor
Type:Enzyme
Mol. Mass.:85656.87
Organism:Homo sapiens (Human)
Description:P04150
Residue:777
BDBM50414615
NameBDBM50414615
Synonyms:CHEMBL559942
TypeSmall organic molecule
Emp. Form.C27H27F3N4O2
Mol. Mass.496.5241
SMILESCCN(CC(O)(CNc1cc(C)cc2n(ncc12)-c1ccccc1)C(F)(F)F)C(=O)c1ccccc1