Reaction Details
TargetGlucocorticoid receptor
LigandBDBM50414619
Substrate/Competitorn/a
Meas. Tech.ChEMBL_580474 (CHEMBL1052501)
IC50 2.51±n/a nM
Citation Biggadike, KCaivano, MClackers, MCoe, DMHardy, GWHumphreys, DJones, HTHouse, DMiles-Williams, ASkone, PAUings, IWeller, VMcLay, IMMacdonald, SJ Highly tractable, sub-nanomolar non-steroidal glucocorticoid receptor agonists. Bioorg Med Chem Lett19:4846-50 (2009) 
 
Glucocorticoid receptor
Name:Glucocorticoid receptor
Type:Enzyme
Mol. Mass.:85656.87
Organism:Homo sapiens (Human)
Description:P04150
Residue:777
BDBM50414619
NameBDBM50414619
Synonyms:CHEMBL559547
TypeSmall organic molecule
Emp. Form.C25H25F3N4O3S
Mol. Mass.518.551
SMILESCCN(CC(O)(CNc1cccc2n(ncc12)-c1ccccc1)C(F)(F)F)S(=O)(=O)c1ccccc1