Reaction Details
TargetCathepsin S
LigandBDBM31970
Substrate/Competitorn/a
Meas. Tech.ChEMBL_581589 (CHEMBL1062476)
IC50 125.89±n/a nM
Citation Bethel, PAGerhardt, SJones, EVKenny, PWKaroutchi, GIMorley, ADOldham, KRankine, NAugustin, MKrapp, SSimader, HSteinbacher, S Design of selective Cathepsin inhibitors. Bioorg Med Chem Lett19:4622-5 (2009) 
 
Cathepsin S
Name:Cathepsin S
Type:Protein
Mol. Mass.:37507.38
Organism:Homo sapiens (Human)
Description:P25774
Residue:331
BDBM31970
NameBDBM31970
Synonyms:Dipeptidyl nitrile inhibitor, 1
TypeSmall organic molecule
Emp. Form.C18H16ClN3O2
Mol. Mass.341.792
SMILESClc1cccc(C[C@H](NC(=O)c2ccccc2)C(=O)NCC#N)c1