Reaction Details
TargetCathepsin L2
LigandBDBM50414636
Substrate/Competitorn/a
Meas. Tech.ChEMBL_581586 (CHEMBL1062473)
IC50 25.12±n/a nM
Citation Bethel, PAGerhardt, SJones, EVKenny, PWKaroutchi, GIMorley, ADOldham, KRankine, NAugustin, MKrapp, SSimader, HSteinbacher, S Design of selective Cathepsin inhibitors. Bioorg Med Chem Lett19:4622-5 (2009) 
 
Cathepsin L2
Name:Cathepsin L2
Type:Enzyme
Mol. Mass.:37341.06
Organism:Homo sapiens (Human)
Description:O60911
Residue:334
BDBM50414636
NameBDBM50414636
Synonyms:CHEMBL559880
TypeSmall organic molecule
Emp. Form.C20H17N5O2S
Mol. Mass.391.446
SMILESO=C(NCC#N)C(Cc1cccc(c1)-c1nncs1)NC(=O)c1ccccc1