Reaction Details
TargetProcathepsin L
LigandBDBM50414640
Substrate/Competitorn/a
Meas. Tech.ChEMBL_581585 (CHEMBL1062472)
IC50 125.89±n/a nM
Citation Bethel, PAGerhardt, SJones, EVKenny, PWKaroutchi, GIMorley, ADOldham, KRankine, NAugustin, MKrapp, SSimader, HSteinbacher, S Design of selective Cathepsin inhibitors. Bioorg Med Chem Lett19:4622-5 (2009) 
 
Procathepsin L
Name:Procathepsin L
Type:Enzyme
Mol. Mass.:37557.19
Organism:Homo sapiens (Human)
Description:Purchased from Calbiochem (San Diego, CA).
Residue:333
BDBM50414640
NameBDBM50414640
Synonyms:CHEMBL562844
TypeSmall organic molecule
Emp. Form.C23H27N7O2S
Mol. Mass.465.571
SMILESCc1nnc(s1)-c1cccc(CC(NC(=O)c2cc(nn2C)C(C)(C)C)C(=O)NCC#N)c1