Reaction Details
TargetCathepsin B
LigandBDBM50414644
Substrate/Competitorn/a
Meas. Tech.ChEMBL_581587 (CHEMBL1062474)
IC50 6309.57±n/a nM
Citation Bethel, PAGerhardt, SJones, EVKenny, PWKaroutchi, GIMorley, ADOldham, KRankine, NAugustin, MKrapp, SSimader, HSteinbacher, S Design of selective Cathepsin inhibitors. Bioorg Med Chem Lett19:4622-5 (2009) 
 
Cathepsin B
Name:Cathepsin B
Type:Enzyme
Mol. Mass.:37819.69
Organism:Homo sapiens (Human)
Description:gi_63102437
Residue:339
BDBM50414644
NameBDBM50414644
Synonyms:CHEMBL555122
TypeSmall organic molecule
Emp. Form.C24H30N8O3
Mol. Mass.478.5468
SMILESCn1nc(cc1C(=O)NC(Cc1cccc(c1)-c1nnc(CCN)o1)C(=O)NCC#N)C(C)(C)C